[Users] [Bug 2552] in automatic checking, enable the use of different time intervals

noreply at thewildbeast.co.uk noreply at thewildbeast.co.uk
Mon Aug 5 22:22:37 CEST 2013


--- Comment #34 from Andrej Kacian <andrej at kacian.sk> ---
Although the patch still applies cleanly to current tip of master branch, I get
following compile errors:

account.c:1767:2: warning: data definition has no type or storage class
[enabled by default]
account.c:1767:2: warning: type defaults to ‘int’ in declaration of
‘inc_acc_autocheck_timer_set’ [-Wimplicit-int]
account.c:1767:2: warning: parameter names (without types) in function
declaration [enabled by default]
account.c:1767:2: error: conflicting types for ‘inc_acc_autocheck_timer_set’
In file included from account.c:46:0:
inc.h:112:6: note: previous declaration of ‘inc_acc_autocheck_timer_set’ was
account.c: In function ‘password_get’:
account.c:1871:2: warning: comparison between pointer and integer [enabled by
make[4]: *** [account.o] Error 1
make[4]: *** Waiting for unfinished jobs....
make[3]: *** [all-recursive] Error 1
make[2]: *** [all] Error 2
make[1]: *** [all-recursive] Error 1
make: *** [all] Error 2

You are receiving this mail because:
You are the assignee for the bug.

More information about the Users mailing list