[Users] Rssyl 0.33cvs6 build failure

Brian Morrison bdm at fenrir.org.uk
Wed Sep 19 09:27:03 CEST 2012

The change to make folder searching work seems to have broken
something, looked like a variable declaration mismatch:

rssyl.c: In function 'rssyl_folder_get_class':
rssyl.c:662:14: error: 'FolderClass' has no member named 'search_msgs'
rssyl.c:662:29: error: 'folder_item_search_msgs_local' undeclared (first use in this function)
rssyl.c:662:29: note: each undeclared identifier is reported only once for each function it appears in
make[2]: *** [rssyl.lo] Error 1



Brian Morrison

                "I am not young enough to know everything"
                                                          Oscar Wilde

More information about the Users mailing list