[Users] Build failure with python-plugin and cvs claws-3.8.1cvs46

Charles A Edwards CAE at eslrahc.com
Sun Sep 9 10:30:15 CEST 2012

Building python_plugin-0.10cvs7 with claws-3.8.1cvs46 now fails for me.

composewindowtype.c: In function ‘ComposeWindow_init’:
composewindowtype.c:104:32: error: dereferencing pointer to incomplete
make[2]: *** [composewindowtype.lo] Error 1
make[2]: Leaving directory
make[1]: *** [all-recursive] Error 1
make[1]: Leaving directory
make: *** [all] Error 2


Patience is a minor form of despair, disguised as virtue.
		-- Ambrose Bierce, on qualifiers
Mageia release 3 (Cauldron) for x86_64$
On SuperSize....http://www.eslrahc.com
Registered Linux user #182463
3.5.3-tmb-server-1.mga3 x86_64
-------------- next part --------------
A non-text attachment was scrubbed...
Name: signature.asc
Type: application/pgp-signature
Size: 198 bytes
Desc: not available
URL: <http://lists.claws-mail.org/pipermail/users/attachments/20120909/91c7c384/attachment.sig>

More information about the Users mailing list